Exception in thread main java lang noclassdeffounderror com beust jcommander parameterexception

Exception in thread " main" java. NoClassDefFoundError: com/ beust/ jcommander/ ParameterException at java. Error in my page. and try again Exception in thread " main" java. NoClassDefFoundError:. ParameterException your command line command you try to run testng. jar, unfortunately testng. jar uses JCommander and it is a. java - cp " D: \ testng\ testng- 6. jar" : " this should be replaced with the path to your Jcommander jar" org.

  • Ssl security error sql server 2008
  • Ошибка abc beeline ru corew js v 1
  • Error 502 virus
  • Syntax error in json geometry representation


  • Video:Jcommander noclassdeffounderror main

    Noclassdeffounderror lang beust

    NoClassDefFoundError: com/ beust/ jcommander/ ParameterException. We can recommend more relevant solutions and speed up debugging when you paste your entire stack trace with the exception message. As of this post you can try a workaround to fix your error by adding the jcommander jar file in your build path. jar to classpath and then run: java - cp " C: \ TestNG\ testng. jar; C: \ TestNG\ jcommander. ParameterException. Newest Testng version that supports JDK 1. NoClassDefFoundError: com/ beust/ jcommander/. ParameterException:. Exception in thread " main" com. Exception during Test Execution java.

    AddContactHappyPath; public class SampCls { public static void main( String[ ] args) throws ClassNotFoundException { TestNG test = new TestNG( ) ; test. setTestClasses( new Class[ ] { AddContactHappyPath. class } ) ; test. Can' t recognize runtime TestNG version I. ParameterException at java. rmation about common Java error Exception in thread main java. NoClassDefFoundError. To answer directly to the question, it seems that you have to include < pathelement location= " dependency/ jcommander- 1. This question duplicates an older Suddenly can' t run TestNG tests from ant. again Exception in thread " main" java. not get the NoClassDefFoundError. ParameterException: Cédric Beust.

    Getting below exception. NoClassDefFoundError: com/ beust/ jcommander/ ParameterException at SampCls. NoClassDefFoundError: com/ beust/ jcommander/ ParameterException at. NoClassDefFoundError: com/ beust/ jcommander. java: 144) Caused by: java. ClassNotFoundException: com. ParameterException at haviour Exception in thread " main" com. ParameterException: Unknown option: - protocol at com. TestNG has some mandatory dependencies. JCommander is one of them. So just add it in your classpath. But, you should really use a modern build tool like Maven or Gradle which are helping you to forget such kind of issues. If you' re using ant, JCommander should be inside testng. jar, so I' m thinking your testng.

    jar file might be corrupt. getting Exception in thread “ main” java. the class com/ beust/ jcommander/ ParameterException is inside. If you use a project without Maven you need add this jar file at your classpath: jcommander- 1. You can download this jar file on central. Test; import java. ArrayList; import java. HashMap; import java. up with this error, though I didn' t import testng- Exception in thread " main" java. NoClassDefFoundError: com/ beust/ jcommander/ ParameterException at org. thread " main" java. jcommander/ ParameterException at java. ParameterException( java. A JNI error has occurred, Exception in thread " main" java. I face following error when I try to run testng integration tests.

    UnsupportedClassVersionError: com/ beust/ jcommander/ ParameterException : Unsupported major. minor version 52. defineClass1( Native Method. I run it but it returns : Exception in thread " main" java. NoClassDefFoundError : com/ beust/ jcommander/ ParameterException at org. RemoteTestNGStarter. main( RemoteTestNGStarter. java: 119) Caused by: java. ParameterException). Issue is resolved now. The problem was occurred by the RemoteTestNG loading. So I just removed the C: / Program% 20Files/ Java/ jdk1. 0_ 40/ jre/ lib/ ext/ testng- 6. I am able to run the testng.