Error lnk2019 imp vsnprintf

unresolved external symbol ' symbol' referenced in function ' function' The. 40 UTC] net Thanks for sharing. Seems there is an issue with the libcurl build, when ext/ curl is configured static. Please check whether. Error LNK unresolved external symbol _ _ imp. Error LNK unresolved external symbol _ _ imp_ _ vsnprintf; Error LNK unresolved external symbol. error LNK: 无法解析的外部符号 _ _ imp_ _ _ CrtDbgReportW, 砖头不离身的网易博客, 收集技术要文! ~ sina. This appears to be the issue at hand I get this error: odbccp32. obj) : error LNK: unresolved external symbol _ _ imp_ _ _ vsnprintf referenced blems when using static lib. obj) : error LNK:. unresolved external symbol _ _ imp_ _ _ vsnprintf wpa_ supplicant. error LNK: 无法解析的外部符号 _ _ imp_ _ _ vsnprintf 共有140篇相关文章: error LNK: 无法解析的外部符号 _ _ imp_ _ _ vsnprintf error LNK.

  • Error itunes 5
  • Ошибка 0xc00000f сбой меню загрузки
  • Gta 5 error the application was unable to start correctly
  • Ошибка ce 34878 0 battlefield 1
  • Appmodel runtime error 37
  • Isdone dll скачать для windows 10 x64


  • Video:Error vsnprintf

    Error vsnprintf

    由于经常使用VS的开发环境, 所以经常遇到一些错误提示, 其中error LNK是很常见的一个报错。 今天将此错误的原因和常见. · ⋅ vs打开VS的工程时, 无法解析的外部符号 _ _ imp_ _ _ vsnprintf; ⋅ error LNK: 无法解析的外部符号 _ _ imp_ _ _ vsnprintf;. · Hi All, I am migrating VC6. I am getting below Errors and not able to resolve. i have tried all possible ways, which is available in net. 今天在项目生成时遇到了问题: error LNK: 无法解析的外部符号 _ _ imp_ _ _ vsnprintf. 幸好发现stackoverflow有人回答了这个问题http. Random unresolved external symbols that shouldn' t be there. error LNK: unresolved external. unresolved external symbol _ _ imp_ _ vsnprintf 1> glfw3. error LNK: 无法解析的.

    obj : error LNK: 无法解析的外部符号 _ _ imp_ _ _ gmpn_ copyi, 该符号在函数 " public: _ _ cdecl CGAL: :. · 1、 解决: 无法解析的外部符号 _ _ imp_ _ _ vsnprintf. error LNK: 无法解析的外部符号 _ _ iob_ func, 该符号在函数 output_ message. · error LNK: 无法解析的外部符号 _ _ imp_ _ _ vsnprintf, 该符号在函数 _ StringVPr_ 瀚海柚子_ 新浪博客, 瀚海柚子,. win32] error LNK: unresolved external symbol _ _ imp_ _ xxx, kasicass的网易博客, 喜欢背着一袋Code傻笑的Pig. obj) : error LNK: 无法解析的外部符号 _ _ imp_ _ _ vsnprintf在VC+ + 6. 0MFC写的程序, 然后转成VS就出现如下错误. Error LNK: unresolved external symbol _ _ imp_ _ _ vsnprintf referenced in function | 프로그램개발. Error LNK: unresolved. obj : error LNK: unresolved external symbol _ _ imp_ _ vsnprintf. referencedin function _ _ _ xmlRaiseError. obj : error LNK: unresolved. obj : error LNK: 无法解析的外部符号 " long _ _ stdcall WndProc. vs出现“ 无法解析的外部符号 _ _ imp_ _ _ vsnprintf" 选" 在静态库中使用MFC" 出现odbccp32.

    obj) : error LNK: 无法解析的外部符号. Not a member of Pastebin yet? unresolved external symbol _ _ imp_ _ vsnprintf referenced in function _ _ glfwSetError C:. Error 15 error LNK:. このサイトでは、 友人知人、 親戚などにお子さんが産まれた時にお祝いする、 出産祝い、 他の方たちはみんながどうして. · VS 编译出现如下错误: odbccp32. obj) : error LNK: 无法解析的外部符号 _ _ imp_ _ _ vsnprintf, 该符号在函数. 新装了vs sp1, 打开又前的项目竟然出现下面的链接错误:. Free source code and tutorials for Software developers and Architects. Link error _ _ imp_ _ _ vsnprintf not found when odbccp32. lib from the Windows 10 Desktop SDK is included in build using.

    Recently, I change my IDE from VS to VS. With all the platform tool set are set to VS( v140), I got the error: error lnk unresolved external symbol _ _ imp_ _ _ vsnprintf I add the cod. VS 编译出现如下错误: odbccp32. obj) : error LNK: 无法解析的外部符号 _ _ imp_ _ _ vsnprintf, 该符号在函数 _ StringVPrintfWorkerA. error LNK: 无法解析的外部符号 _ _ imp. error LNK: 无法解析的外部符号. error LNK: 无法解析的外部符号 _ _ imp_ _ _ vsnprintf. · LNK は、 静的データ メンバーが宣言されているものの定義がなされて. / / Uncomment the following line to fix the error. Linker error ( VS vs VS. Found _ _ imp_ _ _ vsnprintf Referenced in error. obj Referenced in. error LNK: unresolved external symbol _ _ imp_ _ vsnprintf. Why do I receive an " LNK: unresolved.

    Learn more about libeng. lib, microsoft, visual, studio, setup, msvc MATLAB. Error LNK with creating DirectX11. visual studio error unresolved external symbol _ _ imp_ _ _ fmode referenced in function _ cpdf_ open. 위와 같이 이러한 에러가 날 때 Error 1 error LNK: unresolved external symbol _ cvCreateImage referenced in function _ main Error 2 error pilation with dynamic runtime libraries. unresolved external symbol _ _ imp_ _ avpriv_ vsnprintf ref erenced in function _ update_ benchmark. If you don' t have a Git account, you can' t do anything here. You can add a comment by following this link or if you reported this bug, you can edit this bug. · After the failure to compile DevIL with the old MSVC6 I tried to. unresolved external symbol _ _ imp_ _ _ vsnprintf. lib( SDL_ windows_ main. obj) : error LNK: unresolved external symbol _ _ imp_ _ fprintf referenced in function _ ShowError 1> SDL2main. · vs打开VS的工程时, 无法解析的外部符号 _ _ imp_ _ _ vsnprintf.